{"text_format":"1","workbook":"xlsx","n_sheets":18,"sheets":["Application Instructions","Funding - WITH Rent Subsidy","Funding - W.O. Rent Subsidy","D.1 Acq Predev Financing","D.2 Sources","D.3 Development Budget w Notes","D.4 Operating Budget w Notes","D.5 Unit Mix, Rents, Subsidy","D.6 20-Year Cash Flow","D.7.a. 9% Threshold Basis Limit","D.7.b. 9% Tax Credit Calc","4% Tiebreaker","D.8.a. 4% TC Threshold Basis","D.8.b. 4% Tax Credit Calc","4% TieBreak - HIDE","drop down menus","I.16 Sust. Bldg. Methods ","I.16a Hlthy. Design Elem. "],"not_rendered":{"charts":0,"images":1,"macros":1,"external_links":0,"defined_names":260,"comments":1,"pivot_tables":0},"unopened":[],"bounds":{"document_bytes":16777216,"sheet_cells":100000,"rows_first":2000,"rows_last":500,"rows_between":2000,"halvings":0,"cell_chars":16384,"cell_head_chars":4096},"cells_cut":0,"cells_raw":0,"read":"whole","date_system":"1900"}

{"sheet":"Application Instructions","index":0,"n_rows":13,"n_cols":9,"rows_kept":13,"cut":false,"hidden":false,"merged":[[12,0,12,7],[10,1,10,7],[0,1,0,7],[2,1,2,7],[6,1,6,7],[1,1,1,7],[4,3,4,7],[4,1,4,2]]}
[]
[null,"NOTICE OF FUNDING AVAILABILITY - UNOFA APPLICATION",null,null,null,null,null,null,"Rev. 5.15.2026"]
[null,"FINANCIAL PROFORMA"]
[]
[null,"PROJECT NAME: "]
[null,"Introduction:"]
{"$rows_left_out":8}
{"sheet":"Funding - WITH Rent Subsidy","index":1,"n_rows":59,"n_cols":11,"rows_kept":59,"cut":false,"hidden":false,"merged":[[58,0,58,7],[44,1,45,1],[44,2,44,5],[49,1,50,1],[49,2,49,5],[53,2,53,3],[54,2,54,3],[28,3,28,6],[36,2,36,3],[39,1,41,1],[39,2,39,5],[23,1,23,2],[24,1,24,2],[25,1,25,2],[26,1,26,2],[27,1,27,2],[28,1,28,2],[22,1,22,2],[9,1,9,2],[10,1,10,2],[11,1,11,2],[12,1,12,2],[13,1,13,2],[14,1,14,2],[15,1,15,2],[17,1,17,2],[19,1,19,2],[20,1,20,2],[8,1,8,2],[3,1,3,7],[4,1,4,6],[6,3,7,3],[6,4,7,4],[6,5,6,6]]}
[]
[null,"Eligible Population / Funding Source - Projects Supported by a Rental Subsidy",null,null,null,null,{"$f":"IF('Application Instructions'!D5<>\"\",'Application Instructions'!D5,\"\")","v":""}]
[]
[null,"For the purpose of funding eligibility, indicate the number of units by primary target population and funding source. Do not double count. "]
[null,"GUIDANCE FOR PROJECTS SUPPORTED BY A RENTAL SUBSIDY:  At least 20% of Project units (excluding the manager's unit) must be set aside for eligible Special Needs populations earning no more than 30% of the Area Median Income (\"AMI\").  \n\nSpecial Needs Units are eligible for AHTF Assistance from the LACDA; General Affordable Units are not eligible for AHTF Assistance from the LACDA. \n\nThis guidance applies to Projects supported by a Rental Subsidy from the LACDA or any other local or federal issuer. Projects WITHOUT Rental Subsidy should utilize the tab labeled \"Funding -  W.O. Rent Subsidy.\""]
[]
{"$rows_left_out":54}
{"sheet":"Funding - W.O. Rent Subsidy","index":2,"n_rows":55,"n_cols":11,"rows_kept":55,"cut":false,"hidden":false,"merged":[[54,0,54,7],[23,1,23,2],[32,2,32,3],[40,2,40,5],[35,2,35,5],[23,3,23,4],[3,1,3,7],[8,1,8,2],[10,1,10,2],[11,1,11,2],[20,1,20,2],[6,4,7,4],[19,1,19,2],[12,1,12,2],[18,1,18,2],[6,3,7,3],[17,1,17,2],[4,1,4,6],[22,1,22,2],[50,2,50,3],[13,1,13,2],[9,1,9,2],[15,1,15,2],[14,1,14,2],[40,1,41,1],[45,1,46,1],[49,2,49,3],[21,1,21,2],[35,1,37,1],[45,2,45,5]]}
[]
[null,"Eligible Population / Funding Source - Projects WITHOUT Rental Subsidy",null,null,null,null,{"$f":"IF('Application Instructions'!D5<>\"\",'Application Instructions'!D5,\"\")","v":""}]
[]
[null,"For the purpose of funding eligibility, indicate the number of units by primary target population and funding source. Do not double count. "]
[null,"GUIDANCE FOR PROJECTS WITHOUT RENTAL SUBSIDY:  At least 10% of Project units (excluding the manager's unit) must be set aside for Extremely Low-Income (\"ELI\") households (either General Affordable or Non-Homeless Special Needs) earning no more than 30% of the Area Median Income (\"AMI\").  \n\nGeneral Affordable Units up to 80% AMI are eligible for AHTF Assistance from the LACDA (subject to the above restriction for the Minimum 10% ELI Units); Homeless Special Needs units are not eligible for AHTF Assistance from the LACDA.\n\nProjects supported by a Rental Subsidy from the LACDA or any other local or federal issuer should utilize the tab labeled \"Funding - WITH Rent Subsidy.\"\n\nNon-Homeless Special Needs Populations eligible for AHTF Assistance from the LACDA include: Persons Living with HIV/AIDs; People with Intellectual or Developmental Disabilities; Transition Age Youth; and Survivors of Domestic Violence, Human Trafficking or Sexual Assault."]
[]
{"$rows_left_out":50}
{"sheet":"D.1 Acq Predev Financing","index":3,"n_rows":61,"n_cols":7,"rows_kept":61,"cut":false,"hidden":false,"merged":[[14,4,14,6],[23,4,23,6],[37,4,37,6],[30,4,30,5],[26,4,26,6],[21,4,21,5],[28,4,28,6],[35,4,35,6],[36,4,36,6],[19,4,19,6],[20,4,20,6],[25,4,25,6],[24,4,24,6],[27,4,27,6],[29,4,29,6],[32,4,32,6],[16,4,16,6],[15,4,15,6],[17,4,17,6],[18,4,18,6],[34,4,34,6],[33,4,33,6],[51,4,51,6],[53,4,53,6],[54,4,54,6],[38,4,38,6],[50,4,50,6],[48,4,48,5],[45,4,45,6],[46,4,46,6],[47,4,47,6],[44,4,44,6],[41,4,41,6],[43,4,43,6],[42,4,42,6],[39,4,39,5],[57,4,57,5],[60,0,60,6],[55,4,55,6],[56,4,56,6],[52,4,52,6]]}
[]
[null,"D.1 Acquisition & Predevelopment Financing",null,null,null,null,{"$f":"IF('Application Instructions'!D5<>\"\",'Application Instructions'!D5,\"\")","v":""}]
[]
[null,null,"Lien Position","Name of Lender/Source","Term in Months","Interest Rate","Amount of Funds"]
[]
[]
{"$rows_left_out":56}
{"sheet":"D.2 Sources","index":4,"n_rows":170,"n_cols":13,"rows_kept":170,"cut":false,"hidden":false,"merged":[[169,0,169,13],[94,4,94,6],[89,4,89,6],[87,4,87,5],[95,4,95,6],[140,4,140,5],[120,4,120,5],[118,4,118,5],[119,4,119,5],[122,4,122,6],[133,4,133,6],[137,4,137,6],[138,4,138,6],[139,4,139,6],[127,4,127,6],[128,4,128,6],[135,4,135,6],[134,4,134,6],[136,4,136,6],[129,4,129,5],[130,4,130,5],[131,4,131,5],[93,4,93,6],[164,4,164,5],[141,4,141,5],[142,4,142,5],[151,4,151,5],[152,4,152,5],[153,4,153,5],[147,4,147,6],[148,4,148,6],[149,4,149,6],[150,4,150,6],[144,4,144,6],[146,4,146,6],[145,4,145,6],[157,4,157,6],[156,4,156,6],[158,4,158,6],[159,4,159,6],[160,4,160,6],[161,4,161,6],[162,4,162,5],[163,4,163,5],[155,4,155,6],[3,11,4,11],[72,4,72,6],[73,4,73,6],[78,4,78,6],[80,4,80,6],[79,4,79,6],[81,4,81,6],[82,4,82,6],[67,4,67,6],[69,4,69,6],[70,4,70,6],[71,4,71,6],[68,4,68,6],[22,4,22,6],[23,4,23,6],[75,4,75,5],[76,4,76,5],[47,4,47,6],[50,2,50,12],[74,4,74,5],[84,4,84,6],[106,4,106,6],[104,4,104,6],[117,4,117,6],[105,4,105,6],[112,4,112,6],[114,4,114,6],[115,4,115,6],[116,4,116,6],[91,4,91,6],[107,4,107,5],[103,4,103,6],[101,4,101,6],[108,4,108,5],[111,4,111,6],[113,4,113,6],[109,4,109,5],[86,4,86,5],[96,4,96,5],[97,4,97,5],[98,4,98,5],[90,4,90,6],[92,4,92,6],[83,4,83,6],[85,4,85,5],[124,4,124,6],[123,4,123,6],[125,4,125,6],[126,4,126,6],[100,4,100,6],[1,11,1,12],[63,4,63,5],[54,4,54,6],[55,4,55,6],[56,4,56,6],[57,4,57,6],[58,4,58,6],[59,4,59,6],[60,4,60,6],[61,4,61,5],[62,4,62,5],[48,4,48,6],[2,1,2,11],[3,12,4,12],[28,11,29,11],[28,12,29,12],[1,1,1,3]]}
[]
[null,"D.2 Sources",null,null,null,null,null,null,null,null,null,{"$f":"IF('Application Instructions'!D5<>\"\",'Application Instructions'!D5,\"\")","v":""}]
[]
[null,null,null,null,null,null,null,null,null,null,null,"Residential Component","Commercial Component"]
[null,null,"CONSTRUCTION SOURCES"]
[null,null,"Lien Position","Name of Lender/Source","Notes for Lender/Source\n(if \"Other\", lender not specified, etc.)","Term in Months","Interest Rate","Amount of Funds",null,null,null,"Amount of Funds","Amount of Funds"]
{"$rows_left_out":165}
{"sheet":"D.3 Development Budget w Notes","index":5,"n_rows":139,"n_cols":11,"rows_kept":139,"cut":false,"hidden":false,"merged":[[4,6,5,6],[4,7,5,7],[4,9,5,9],[4,0,4,1],[9,10,9,16],[10,10,10,16],[13,10,13,16],[14,10,14,16],[15,10,15,16],[3,10,5,16],[1,10,1,16],[7,10,7,16],[8,10,8,16],[22,10,22,16],[23,10,23,16],[24,10,24,16],[25,10,25,16],[16,10,16,16],[17,10,17,16],[18,10,18,16],[19,10,19,16],[21,10,21,16],[20,10,20,16],[37,10,37,16],[38,10,38,16],[39,10,39,16],[40,10,40,16],[41,10,41,16],[26,10,26,16],[29,10,29,16],[30,10,30,16],[31,10,31,16],[34,10,34,16],[47,10,47,16],[48,10,48,16],[49,10,49,16],[50,10,50,16],[51,10,51,16],[42,10,42,16],[43,10,43,16],[44,10,44,16],[45,10,45,16],[46,10,46,16],[58,10,58,16],[61,10,61,16],[62,10,62,16],[63,10,63,16],[65,10,65,16],[52,10,52,16],[53,10,53,16],[54,10,54,16],[56,10,56,16],[57,10,57,16],[55,10,55,16],[64,10,64,16],[75,10,75,16],[76,10,76,16],[79,10,79,16],[80,10,80,16],[81,10,81,16],[66,10,66,16],[67,10,67,16],[70,10,70,16],[72,10,72,16],[73,10,73,16],[71,10,71,16],[74,10,74,16],[91,10,91,16],[94,10,94,16],[95,10,95,16],[96,10,96,16],[82,10,82,16],[83,10,83,16],[86,10,86,16],[89,10,89,16],[90,10,90,16],[103,10,103,16],[104,10,104,16],[105,10,105,16],[106,10,106,16],[107,10,107,16],[97,10,97,16],[99,10,99,16],[100,10,100,16],[101,10,101,16],[102,10,102,16],[98,10,98,16],[113,10,113,16],[114,10,114,16],[115,10,115,16],[116,10,116,16],[117,10,117,16],[108,10,108,16],[109,10,109,16],[110,10,110,16],[111,10,111,16],[112,10,112,16],[138,0,138,16],[132,10,132,16],[126,10,126,16],[127,10,127,16],[128,10,128,16],[129,10,129,16],[118,10,118,16],[119,10,119,16],[121,10,121,16],[124,10,124,16],[125,10,125,16]]}
[]
["D.3  Development Budget + Notes & Assumptions",null,null,null,null,null,null,null,null,null,{"$f":"IF('Application Instructions'!D5<>\"\",'Application Instructions'!D5,\"\")","v":""}]
[]
[null,null,null,null,null,null,"Eligible Basis",null,null,null,"Development Budget Notes & Assumptions \n\nAll individual line items must be completed, with details for assumptions, as applicable."]
["All budget items must be completed as applicable.",null,null,"Residential","Non-Residential",null,"New Construction / Rehab","Acquisition",null,"Residential Cost/Unit"]
[null,null,"Total",null,{"$f":"1-D6","v":1}]
{"$rows_left_out":134}
{"sheet":"D.4 Operating Budget w Notes","index":6,"n_rows":67,"n_cols":11,"rows_kept":67,"cut":false,"hidden":false,"merged":[[58,2,59,2],[58,3,59,3],[58,4,59,4],[58,5,59,5],[59,10,59,13],[62,6,62,13],[1,3,1,4],[2,2,3,2],[2,5,3,5],[65,0,65,3],[64,0,64,3],[60,2,61,2],[60,3,61,3],[60,4,61,4],[60,5,61,5],[7,6,7,13],[8,6,8,13],[9,6,9,13],[4,6,4,13],[6,6,6,13],[10,6,10,13],[11,6,11,13],[12,6,12,13],[13,6,13,13],[14,6,14,13],[15,6,15,13],[16,6,16,13],[17,6,17,13],[18,6,18,13],[19,6,19,13],[22,6,22,13],[23,6,23,13],[24,6,24,13],[25,6,25,13],[26,6,26,13],[27,6,27,13],[34,6,34,13],[35,6,35,13],[36,6,36,13],[58,6,58,13],[28,6,28,13],[29,6,29,13],[30,6,30,13],[31,6,31,13],[32,6,32,13],[42,6,42,13],[50,6,50,13],[57,6,57,13],[66,0,66,13],[60,6,60,13],[1,6,1,13],[3,6,3,13],[51,6,51,13],[52,6,52,13],[44,6,44,13],[45,6,45,13],[46,6,46,13],[55,6,55,13],[37,6,37,13],[38,6,38,13],[39,6,39,13],[40,6,40,13],[43,6,43,13],[33,6,33,13]]}
[]
["D.4  Operating Budget + Notes and Assumptions",null,null,null,null,null,{"$f":"IF('Application Instructions'!D5<>\"\",'Application Instructions'!D5,\"\")","v":""}]
[null,null,"Residential Component",null,null,"Commercial Component"]
[null,null,null,null,null,null,"All items must be completed, with details for assumptions, as applicable."]
[null,null,"Proposed Budget","Per Unit Per Month","Per Unit Per Year","Proposed Budget","Operating Budget Notes & Assumptions"]
[]
{"$rows_left_out":62}
{"sheet":"D.5 Unit Mix, Rents, Subsidy","index":7,"n_rows":198,"n_cols":50,"rows_kept":198,"cut":false,"hidden":false,"merged":[[197,0,197,16],[4,46,4,47],[145,2,145,5],[146,2,146,5],[123,2,123,5],[67,11,67,13],[50,4,50,6],[57,4,57,5],[68,11,68,13],[58,4,58,5],[67,5,68,5],[126,2,126,5],[62,1,62,2],[58,1,58,2],[29,1,29,11],[60,4,60,5],[2,1,2,11],[52,1,52,3],[30,1,30,11],[54,4,54,5],[54,1,54,3],[141,2,141,5],[59,4,59,5],[127,2,127,5],[94,1,94,8],[106,1,106,4],[104,3,104,5],[64,5,65,5],[67,1,67,3],[68,1,68,3],[104,1,104,2],[124,2,124,5],[125,2,125,5],[59,1,59,2],[57,1,57,2],[60,1,60,2],[56,1,56,2],[4,43,4,44],[4,39,4,41],[4,19,4,37],[52,4,52,5],[53,4,53,5],[25,13,27,13],[56,4,56,5],[51,4,51,5],[55,4,55,5],[55,1,55,2],[156,1,156,2],[156,3,156,5],[128,2,128,5],[129,2,129,5],[132,2,132,5],[133,2,133,5],[135,2,135,5],[134,2,134,5],[153,1,154,6],[147,2,147,5],[142,2,142,5],[144,2,144,5],[143,2,143,5],[136,2,136,5],[137,2,137,5],[138,2,138,5]]}
[]
[null,"D.  Unit Mix, Rents and Rental Subsidies",null,null,null,null,null,null,null,null,null,null,null,null,null,{"$f":"IF('Application Instructions'!D5<>\"\",'Application Instructions'!D5,\"\")","v":""},{"$f":"IF('Application Instructions'!E5<>\"\",'Application Instructions'!E5,\"\")","v":""}]
[]
[null,"Project Rent Schedule For Special Needs and Non-Special Needs Units"]
[null,"The most restrictive rents from Funding Sources must be used as the monthly gross rent. Manager's units and Market rate units will be counted separately in the tables below. ENTER RENTAL SUBSIDY INFORMATION ONLY IF APPLICABLE.",null,null,null,null,null,null,null,null,null,null,null,null,null,null,null,null,null,"The information below is for reviewer's use only:",null,null,null,null,null,null,null,null,null,null,null,null,null,null,null,null,null,null,null,"Calculation of Rent Subsidy Premium (e.g., Shelter Plus Care, PBV, or PBVASH)",null,null,null,"Calculation of Net Tenant Rent",null,null,"4% Tie Breaker Calcs"]
[null,"Unit Size","# of Units","% AMI","LACDA AHTF Assisted Units? (Y/N)","Target Population","Applicable Agency Rent (CTCAC or Other)","CTCAC Monthly Rent Limit \n(per unit)","Alternative Monthly Rent Limit \n(per unit)\n(Manual Input, in lieu of CTCAC Rents)","Monthly Rents\n(i.e. Rent Limit multiplied by the number of Units)"," Monthly Utility Allowance\n(i.e. UA multiplied by the number of Units)","Net Monthly Rents \n(i.e. Monthly Rent minus Monthly UA)","Rental Subsidy? \n(i.e. PBVs, PBVASH, FHSP)","Net Subsidy Payment Standard (per unit)\n(i.e. Gross Subsidy Payment Standard minus UA; the \"Contract Rent\")","Net Monthly Subsidy Payment Standard","Net Monthly Subsidy Premium \n(i.e. Net Monthly Subsidy Payment Standard minus Net Monthly Rents)","Total Monthly Income\n(i.e. Net Monthly Rents + Net Monthly Subsidy Premium)",null,null,"<= 30% AMI","31 - 50% AMI","\"LACDA-Assisted\"","\"Federal Vouchers\"","\"No Federal  Vouchers\"","\"SN\"","SN - Homeless","SN - Homeless Seniors","SN - Chronically Homeless","SN - Homeless Veterans","SN - Homeless Persons Living with a Mental Illness","SN - Homeless Transition Age Youth","SN - Persons Living with HIV/AIDS","SN - Persons with Intellectual and Developmental Disabilities","SN - At Risk Transition Age Youth","SN - Survivors of DV / HT / SA","General Affordable - Extremely Low Income","General Affordable - Family","General Affordable - Seniors",null,"Difference","Total Monthly Subsidy Premium","Annual Subsidy Premium",null,"SN Tenant Rent","Non-SN Tenant Rent",null,"Non-Federal Vouchers income Averaging","FMR","Monthly DELTA","DELTA x Units"]
{"$rows_left_out":193}
{"sheet":"D.6 20-Year Cash Flow","index":8,"n_rows":84,"n_cols":22,"rows_kept":84,"cut":false,"hidden":false,"merged":[[2,0,2,8],[1,20,1,21],[83,0,83,21]]}
[]
["D.6  20-Year Cash Flow",null,null,null,null,null,null,null,null,null,null,null,null,null,null,null,null,null,null,null,{"$f":"'Application Instructions'!D5","v":0}]
[]
[{"$f":"IF('Application Instructions'!D5<>\"\",'Application Instructions'!D5,\"\")","v":""},null,1,2,3,4,5,6,7,8,9,10,11,12,13,14,15,16,17,18,19,20]
[]
["Gross Potential Income - SN Residential Rent",2.5000000000000001E-2,{"$f":"+'D.5 Unit Mix, Rents, Subsidy'!AR26*12","v":0},{"$f":"C6*(1+$B$6)","v":0},{"$f":"D6*(1+$B$6)","v":0},0,0,0,0,0,0,0,0,0,0,0,0,0,0,0,0,0]
{"$rows_left_out":79}
{"sheet":"D.7.a. 9% Threshold Basis Limit","index":9,"n_rows":40,"n_cols":9,"rows_kept":40,"cut":false,"hidden":false,"merged":[[39,0,39,6],[22,2,22,4],[14,1,15,1],[15,2,15,4],[5,1,5,2],[6,1,6,2],[7,1,7,2],[8,1,8,2],[9,1,9,2],[11,1,11,3],[16,2,16,4],[17,2,17,4],[18,2,18,4],[19,2,19,4],[20,2,20,4],[21,2,21,4],[34,2,34,6],[36,2,36,6],[27,2,27,4],[23,2,23,4],[26,2,26,4],[31,2,31,4],[24,2,24,4],[25,2,25,4],[32,2,32,4],[5,5,5,6],[14,2,14,4],[6,5,6,6],[7,5,7,6],[8,5,8,6],[9,5,9,6],[10,5,10,6],[10,1,10,2],[12,1,12,4],[13,1,13,4],[11,5,11,6],[14,5,15,5],[14,6,15,6],[12,5,12,6]]}
[null,null,null,null,null,null,null," "]
[null,"D.7.a  Tax Credit Threshold Basis Limit - 9% Projects",null,null,null,null,{"$f":"IF('Application Instructions'!D5<>\"\",'Application Instructions'!D5,\"\")","v":""}]
[]
[null,"Determination of Threshold Basis"]
[]
[null,"Unit Size",null,"Unit Basis Limit","No. Of Units","Basis x No. Of Units"]
{"$rows_left_out":35}
{"sheet":"D.7.b. 9% Tax Credit Calc","index":10,"n_rows":80,"n_cols":5,"rows_kept":80,"cut":false,"hidden":false,"merged":[[3,1,3,4],[23,2,23,4],[43,2,43,4],[66,1,66,4],[79,0,79,5]]}
[]
[null,"D.7.b  Tax Credit Calculation - 9% Projects",null,null,{"$f":"IF('Application Instructions'!D5<>\"\",'Application Instructions'!D5,\"\")","v":""}]
[]
[null,"Tax credit factors shall be limited to the allowable prices defined by TCAC. "]
[]
[null,"Determination of Eligible and Qualified Basis"]
{"$rows_left_out":75}
{"sheet":"4% Tiebreaker","index":11,"n_rows":105,"n_cols":12,"rows_kept":105,"cut":false,"hidden":true,"merged":[[104,0,104,12],[82,4,82,5],[75,3,75,4],[76,3,76,4],[77,3,77,4],[77,5,77,6],[101,1,101,6],[101,7,101,8],[83,4,84,5],[97,1,97,6],[97,7,97,8],[98,1,98,6],[98,7,98,8],[99,1,99,6],[99,7,99,8],[93,1,93,6],[94,1,94,6],[94,7,94,8],[95,1,95,6],[96,1,96,6],[86,4,86,5],[34,5,34,6],[62,1,62,12],[78,7,78,8],[70,7,71,8],[72,7,72,8],[73,7,73,8],[81,4,81,5],[80,4,80,5],[72,3,72,4],[73,3,73,4],[74,3,74,4],[70,5,71,6],[72,5,72,6],[73,5,73,6],[74,5,74,6],[77,7,77,8],[66,1,66,14],[70,3,71,4],[49,1,49,3],[49,4,50,4],[49,5,50,5],[49,6,49,9],[39,8,39,9],[52,5,52,6],[29,5,29,6],[11,5,11,6],[11,1,11,3],[24,5,24,6],[27,1,27,3],[22,5,22,6],[25,5,25,6],[19,5,19,6],[20,1,20,3],[27,5,27,6],[21,5,21,6],[21,1,21,3],[22,1,22,3],[6,1,6,3],[6,6,6,9],[7,1,7,3],[7,6,7,9],[6,5,7,5],[6,4,7,4],[19,1,19,3],[20,5,20,6],[17,5,17,6],[18,5,18,6],[12,5,12,6],[13,5,13,6],[16,1,16,3],[17,1,17,3],[18,1,18,3],[1,10,1,12],[20,11,20,12],[39,11,39,12],[40,11,40,12],[45,8,46,9],[45,10,45,12],[44,10,44,12],[6,10,7,10],[19,11,19,12],[18,11,18,12],[39,5,39,6],[40,5,40,6],[38,5,38,6],[75,7,75,8],[76,7,76,8],[74,7,74,8],[75,5,75,6],[76,5,76,6],[59,5,59,6],[50,6,50,9],[57,2,57,12],[50,1,50,3],[47,10,47,12],[44,5,44,6],[45,5,45,6],[47,5,47,6],[61,1,61,10],[49,10,50,10]]}
[]
[null,"D.7.c  Tax Credit - 9% Projects Tie Breaker Self-Score",null,null,null,null,null,null,null,null,{"$f":"IF('Application Instructions'!D5<>\"\",'Application Instructions'!D5,\"\")","v":""}]
[]
[null,"Tie Breaker Formula"]
[]
[]
{"$rows_left_out":100}
{"sheet":"D.8.a. 4% TC Threshold Basis","index":12,"n_rows":35,"n_cols":9,"rows_kept":35,"cut":false,"hidden":false,"merged":[[34,0,34,7],[12,1,12,4],[12,5,12,6],[8,1,8,2],[8,5,8,6],[9,1,9,2],[9,5,9,6],[10,1,10,2],[10,5,10,6],[14,6,15,6],[17,2,17,4],[18,2,18,4],[19,2,19,4],[20,2,20,4],[13,1,13,4],[14,2,14,4],[26,8,28,8],[27,2,27,3],[28,2,28,3],[23,2,23,4],[22,2,22,4],[29,6,31,6],[30,2,30,3],[31,2,31,3],[2,2,2,3],[15,2,15,4],[5,1,5,2],[5,5,5,6],[6,1,6,2],[6,5,6,6],[7,1,7,2],[7,5,7,6],[26,6,28,6],[16,2,16,4],[26,5,28,5],[14,1,15,1],[21,2,21,4],[32,2,32,5],[25,2,25,4],[26,2,26,4],[14,5,15,5],[11,1,11,3],[24,2,24,4],[29,2,29,4],[29,5,31,5]]}
[null,null,null,null,null,null,null," "]
[null,"D.8.a Tax Credit Threshold Basis Limit - 4% Projects",null,null,null,null,{"$f":"IF('Application Instructions'!D5<>\"\",'Application Instructions'!D5,\"\")","v":""}]
[]
[null,"Determination of Threshold Basis"]
[]
[null,"Unit Size",null,"Unit Basis Limit","No. Of Units","Basis x No. Of Units",null,null,"9% Tax Credits"]
{"$rows_left_out":30}
{"sheet":"D.8.b. 4% Tax Credit Calc","index":13,"n_rows":89,"n_cols":5,"rows_kept":89,"cut":false,"hidden":false,"merged":[[88,0,88,5],[3,1,3,4],[23,2,23,4],[43,2,43,4],[66,1,66,4]]}
[]
[null,"D.8.b  Tax Credit Calculation - 4% Projects",null,null,{"$f":"IF('Application Instructions'!D5<>\"\",'Application Instructions'!D5,\"\")","v":""}]
[]
[null,"Tax credit factors shall be limited to the allowable prices defined by TCAC. "]
[]
[null,"Determination of Eligible and Qualified Basis"]
{"$rows_left_out":84}
{"sheet":"4% TieBreak - HIDE","index":14,"n_rows":169,"n_cols":9,"rows_kept":169,"cut":false,"hidden":true,"merged":[[86,2,87,5],[13,6,13,7],[14,1,14,3],[15,1,15,3],[8,1,8,3],[8,6,8,7],[9,1,9,3],[9,6,9,7],[10,1,10,3],[10,6,10,7],[14,6,14,7],[23,0,23,1],[24,0,24,1],[28,2,28,3],[42,0,42,1],[43,0,43,1],[44,0,44,1],[45,0,45,1],[46,0,46,1],[35,0,35,1],[36,0,36,1],[38,0,38,1],[38,2,40,7],[39,0,39,1],[5,0,5,1],[6,0,6,1],[7,1,7,4],[7,6,7,8],[11,1,11,3],[12,1,12,3],[12,6,12,8],[13,1,13,3],[21,4,22,4],[21,5,22,5],[21,6,22,6],[15,6,15,7],[16,6,16,7],[18,0,18,1],[20,0,20,1],[21,2,22,2],[21,3,22,3],[16,1,16,3],[17,1,17,3],[40,0,40,1],[59,0,59,1],[60,0,60,1],[61,0,61,1],[62,0,62,1],[63,0,63,1],[64,0,64,1],[47,0,47,1],[49,0,49,1],[50,0,50,1],[51,0,51,1],[52,0,52,1],[53,0,53,1],[54,0,54,1],[55,0,55,1],[56,0,56,1],[58,0,58,1],[71,0,71,1],[72,0,72,1],[73,0,73,1],[74,0,74,1],[75,0,75,1],[76,0,76,1],[65,0,65,1],[66,0,66,1],[67,0,67,1],[68,0,68,1],[69,0,69,1],[70,0,70,1],[77,0,77,1],[78,0,78,1],[79,0,79,1],[81,0,81,1],[82,0,82,1],[83,0,83,1],[84,0,84,1],[85,0,85,1],[86,0,86,1],[91,0,91,1],[93,0,93,1],[94,0,94,1],[96,0,96,1],[97,0,97,1],[98,0,98,1],[87,0,87,1],[88,0,88,1],[89,0,89,1],[90,0,90,1],[92,0,92,1],[106,0,106,1],[107,0,107,1],[108,0,108,1],[109,0,109,1],[110,0,110,1],[111,0,111,1],[99,0,99,1],[100,0,100,1],[101,0,101,1],[102,0,102,1],[103,0,103,1],[104,0,104,1],[118,0,118,1],[119,0,119,1],[120,0,120,1],[121,0,121,1],[122,0,122,1],[123,0,123,1],[112,0,112,1],[113,0,113,1],[114,0,114,1],[115,0,115,1],[116,0,116,1],[117,0,117,1],[131,0,131,1],[132,0,132,1],[132,2,133,5],[133,0,133,1],[134,0,134,1],[135,0,135,1],[124,0,124,1],[125,0,125,1],[126,0,126,1],[127,0,127,1],[128,0,128,1],[129,0,129,1],[153,0,153,1],[135,6,137,7],[136,0,136,1],[137,0,137,1],[138,0,138,1],[139,0,139,1],[139,2,141,5],[140,0,140,1],[141,0,141,1],[164,0,164,1],[165,0,165,1],[168,0,168,9],[142,0,142,1],[143,0,143,1],[143,2,146,5],[144,0,144,1],[145,0,145,1],[146,0,146,1],[161,0,161,1],[162,0,162,1],[163,0,163,1],[154,0,154,1],[155,0,155,1],[157,0,157,1],[158,0,158,1],[159,0,159,1],[159,2,160,5],[160,0,160,1],[147,0,147,1],[149,0,149,1],[150,0,150,1],[151,0,151,1],[152,0,152,1]]}
["D.8.c  4% Tax Credit - Tie Breaker Calculation",null,null,null,null,null,{"$f":"IF('Application Instructions'!D5<>\"\",'Application Instructions'!D5,\"\")","v":""}]
[]
[null,null,null,null,null,"Public Benefit Numerator",null,{"$f":"E18","v":0}]
[null,null,null,null,null,"Cost-Adjusted Bond and State Credit Allocation Denominator","÷",{"$f":"I18","v":0}]
[null,null,null,null,null,"Tiebreaker",null,{"$f":"IFERROR(H3/H4,0)","v":0}]
[]
{"$rows_left_out":164}
{"sheet":"drop down menus","index":15,"n_rows":134,"n_cols":17,"rows_kept":134,"cut":false,"hidden":true,"merged":[[57,6,57,10],[13,6,13,7],[14,6,14,7],[15,6,15,7]]}
["(Select)","(Select)"]
["Yes","General Affordable - Extremely Low Income",null,null,null,null,null,"(Select)"]
["No","General Affordable - Family",null,"(Select)",null,null,"(Select)","Unincorporated LA County"]
[null,"General Affordable - Seniors",null,"Seller",null,null,"SPA 1","Incorporated area, outside the City of Los Angeles"]
["(Select)","SN - Homeless",null,"Owner",null,null,"SPA 2","LACDA/County - Owned Land"]
["Non-profit","SN - Homeless Seniors",null,"Tenant",null,null,"SPA 3"]
{"$rows_left_out":129}
{"sheet":"I.16 Sust. Bldg. Methods ","index":16,"n_rows":33,"n_cols":7,"rows_kept":33,"cut":false,"hidden":true,"merged":[[11,1,11,2],[29,1,29,3],[1,1,1,3],[4,1,4,4],[5,2,5,4],[6,2,6,4],[7,2,7,4],[8,2,8,4],[9,2,9,4],[10,2,10,4]]}
[]
[null,"I.16 Sustainable Building Methods Compliance Certification"]
[null,{"$f":"IF(#REF!<>\"\",#REF!,\"\")","v":{"$error":"#REF!"}}]
[]
[null,"REQUIRED SUSTAINABLE BUILDING METHODS"]
[null,1,"Minimum Energy Efficiency: New Construction and Rehabilitation projects must be designed to meet the minimum construction requirements as defined by TCAC Regulations Section 10325(f)(7)(A).  Rehabilitation projects will need to demonstrate a 20% reduction in energy use from tabulated baseline, based on the HERS verified existing condition.  "]
{"$rows_left_out":28}
{"sheet":"I.16a Hlthy. Design Elem. ","index":17,"n_rows":32,"n_cols":5,"rows_kept":32,"cut":false,"hidden":true,"merged":[[28,1,28,3],[1,1,1,3],[4,1,4,2],[11,1,11,3],[16,1,16,3],[19,1,19,3],[2,1,2,3]]}
[]
[null,"I.16a Healthy Design Elements Compliance Certification"]
[null,{"$f":"IF(#REF!<>\"\",#REF!,\"\")","v":{"$error":"#REF!"}}]
[]
[null,"VOLUNTARY HEALTHY DESIGN ELEMENTS - 20 POINTS MAX",null,"Points","Proposed Project"]
[null,1,"Onsite gym incentive:  Projects that include an onsite gym will receive ten (10) points.  Applicants must include at least three varieties of cardio equipment as well as strength training equipment. Room must be open at convenient times (before and after work hours and at lunch, and a minimum of 10 hours per day). ",10]
{"$rows_left_out":26}