{"text_format":"1","workbook":"xlsx","n_sheets":19,"sheets":["drop down menus","Application Instructions","Supporting Documents","General Information","Applicant Experience","Acknowledgement & Cert. ","Applicant Certification","Development Team","Development Timeline","Predev Financing","Sources","Unit Mix & Funding ","Operating Subsidies","Development Budget","Operating Budget","20-Year Cash Flow","H.2 Service Delivery - HIDDEN","I.16 Sust. Bldg. Methods ","I.16a Hlthy. Design Elem. "],"not_rendered":{"charts":0,"images":0,"macros":1,"external_links":1,"defined_names":78,"comments":2,"pivot_tables":0},"unopened":[],"bounds":{"document_bytes":16777216,"sheet_cells":100000,"rows_first":2000,"rows_last":500,"rows_between":2000,"halvings":0,"cell_chars":16384,"cell_head_chars":4096},"cells_cut":0,"cells_raw":0,"read":"whole","date_system":"1900"}

{"sheet":"drop down menus","index":0,"n_rows":58,"n_cols":8,"rows_kept":58,"cut":false,"hidden":true,"merged":[]}
["(Select)"]
["Yes"]
["No",null,null,null,null,null,"(Select)"]
["(Select)",null,null,"Seller",null,null,"Unincorporated Los Angeles"]
["Non-profit",null,null,"Owner",null,null,"City of Los Angeles"]
["For-profit",null,null,"Tenant",null,null,"City of Los Angeles, County Owned Land"]
["(Select)",null,null,null,null,null,"Incorporated area, outside City of Los Angeles"]
["Mixed Population",null,null,null,null,null,"HOME Participating City"]
["Special Needs",null,null,"(Select)"]
[null,null,null,"Single Family",null,null,"(Select)"]
{"$rows_left_out":49}
{"sheet":"Application Instructions","index":1,"n_rows":16,"n_cols":3,"rows_kept":16,"cut":false,"hidden":false,"merged":[[0,1,0,7],[1,1,1,7],[15,2,15,7],[5,1,5,7],[9,1,9,7],[11,2,11,7],[13,2,13,7]]}
[null,"APPENDIX B"]
[null,"APPLICATION FOR FUNDING/PRO FORMA"]
[]
[null,"Introduction"]
[]
[null,"This application accompanies the Request for Proposals (RFP) LACDA21-028  released by the Los Angeles County Development Authority (LACDA).   "]
[]
[null,"Application Instructions"]
[]
[null,"Applications must comply with the general requirements below.  Once an application has been submitted, applicants will not be permitted the opportunity to add any information or cure deficiencies.  "]
{"$rows_left_out":7}
{"sheet":"Supporting Documents","index":2,"n_rows":29,"n_cols":3,"rows_kept":29,"cut":false,"hidden":false,"merged":[[0,1,0,7],[1,1,1,7],[3,1,3,7],[5,2,5,7],[6,2,6,7],[18,2,18,7],[7,2,7,7],[8,2,8,7],[9,2,9,7],[10,2,10,7],[11,2,11,7],[12,2,12,7],[13,2,13,7],[14,2,14,7],[15,2,15,7],[16,2,16,7],[17,2,17,7],[25,2,25,7],[26,2,26,7],[27,2,27,7],[28,2,28,7],[19,2,19,7],[20,2,20,7],[21,2,21,7],[22,2,22,7],[23,2,23,7],[24,2,24,7]]}
[]
[null," Supporting Documents Checklist"]
[]
[null,"Selected project(s) for DR- MHP funds will have to provide the following documents by December 31, 2021, if not already provided in the application."]
[]
[null,1,"Non-Debarment Verification for Partnership, Managing General Partner and Administrative General Partner\n (if applicable)"]
[null,2,"DR-MHP Project Contact Information \n"]
[null,3,"Partnership Agreement"]
[null,4,"DR-MHP Identity of Interest Disclosure "]
[null,5,"Qualifications of Development Team (e.g., resumes)"]
{"$rows_left_out":20}
{"sheet":"General Information","index":3,"n_rows":35,"n_cols":9,"rows_kept":35,"cut":false,"hidden":false,"merged":[[4,2,4,11],[33,3,33,10],[34,3,34,10],[2,3,2,11],[28,8,28,11],[24,3,24,4],[9,4,9,8],[10,4,10,8],[12,4,12,8],[13,4,13,8],[14,4,14,8],[11,4,11,8],[20,4,20,8],[21,4,21,8],[18,4,18,8],[19,4,19,8],[22,1,22,8],[17,1,17,7],[8,1,8,8],[6,2,6,3],[15,4,15,5],[9,1,9,3],[10,1,10,3],[11,1,11,3],[12,1,12,3],[13,1,13,3],[14,1,14,3],[15,1,15,3],[18,1,18,3],[19,1,19,3],[20,1,20,3],[21,1,21,3]]}
[]
[null,"General Application Information"]
[]
[]
[null,"Project Name:"]
[]
[null,"Funding Request:",null,null,null,null,"Max. Funding Based on Formula",null,{"$f":"'Unit Mix & Funding '!D23","v":0}]
[]
[null,"Applicant Information"]
[null,"Applicant's Legal Name      "]
{"$rows_left_out":26}
{"sheet":"Applicant Experience","index":4,"n_rows":38,"n_cols":9,"rows_kept":38,"cut":false,"hidden":false,"merged":[[2,1,2,8]]}
[]
[null,"Applicant Experience"]
[]
[]
[null,"Name of Developer:"]
[null,"List ALL projects of the Lead Developer or the Joint Developer, but not both entities together."]
[]
[null,"Project Name & Address","Date Completed","Project type \n(New Construction or rehab)","Target Population","Number of Restricted Units","Number of Total Units","Principal Funding Sources (LIHTC, MHP, etc.)","Identify if Applicant Was Lead Developer"]
[1]
[2]
{"$rows_left_out":29}
{"sheet":"Acknowledgement & Cert. ","index":5,"n_rows":16,"n_cols":4,"rows_kept":16,"cut":false,"hidden":false,"merged":[[13,1,13,4],[14,1,14,4],[12,1,12,5],[8,1,8,4],[1,1,1,4],[6,1,6,4],[7,1,7,4],[3,3,3,4],[3,1,3,2]]}
[]
[null,"ACKNOWLEDGEMENTS AND CERTIFICATIONS"]
[]
[null,"Applicant:",null,{"$f":"IF('General Information'!C5=\"\",\"\",'General Information'!C5)","v":""}]
[]
[null,"General Application Certification"]
[null,"By checking below, Applicant hereby certifies under penalty of perjury that all representations made in this application are true and correct to the best of Applicant's knowledge, after a prudent and reasonable investigation of all relevant facts and circumstances, at the time of the application's submission."]
[null,"Applicant understands that if the above certification is untrue then, in addition to any remedies available at law or equity to the LACDA, this application may be rejected or the terms and conditions of any funding vehicle shall be modified by the LACDA, even after an award has been made."]
[null,"The representations made in this application shall remain true at all times from the date of this certification until any award is rendered and throughout the term of any loan or grant made to Applicant on account of this application, except that if any such representation should become materially false, misleading or incomplete, Applicant shall immediately notify the LACDA in writing and this application may be rejected or the terms and conditions of any grant or loan shall be modified by the LACDA, even after an award has been made."]
[null,null,"Applicant Acknowledgement and Certification"]
{"$rows_left_out":7}
{"sheet":"Applicant Certification","index":6,"n_rows":40,"n_cols":3,"rows_kept":40,"cut":false,"hidden":false,"merged":[[36,1,36,3],[31,2,31,3],[35,2,35,3],[32,2,32,3],[34,2,34,3],[28,2,28,3],[29,2,29,3],[23,2,23,3],[26,2,26,3],[22,2,22,3],[25,2,25,3],[19,2,19,3],[17,2,17,3],[20,2,20,3],[1,1,1,3],[6,2,6,3],[8,2,8,3],[3,1,3,3],[7,2,7,3],[11,2,11,3],[13,2,13,3],[16,2,16,3],[14,2,14,3],[10,2,10,3]]}
[]
[null,"Applicant Certification Statement"]
[]
[null,"Provide the following information as it relates to each entity of the applicant.  Provide separate forms for each entity, if necessary. Do not leave any question unanswered.  If not applicable, enter \"N/A\".  \n\nFor purposes of this Certification Statement, the term \"applicant\" refers to all persons or entities that are part of the applicant's team in relation to this RFP. The responses to the below questions shall include disclosures regarding jurisdictions outside of California. So if the applicant or any of its partners, principals, or affiliates are active outside of California or subject to the jurisdiction of parties outside of California, the responses below must include this information."]
[]
[null,null,"Applicant's Name:"]
[]
[null,1,"List any additional names or aliases, exercise of power of attorney, and/or fiduciary trust capacities that you are currently using or have used in the past.  If any, please explain."]
[]
[]
{"$rows_left_out":31}
{"sheet":"Development Team","index":7,"n_rows":65,"n_cols":10,"rows_kept":65,"cut":false,"hidden":false,"merged":[[64,4,64,9],[56,4,56,9],[57,4,57,9],[58,4,58,9],[61,4,61,9],[62,4,62,9],[50,4,50,9],[51,4,51,9],[52,4,52,9],[55,4,55,9],[63,4,63,9],[43,4,43,9],[44,4,44,9],[45,4,45,9],[46,4,46,9],[49,4,49,9],[34,4,34,9],[37,4,37,9],[38,4,38,9],[39,4,39,9],[40,4,40,9],[27,4,27,9],[28,4,28,9],[31,4,31,9],[32,4,32,9],[33,4,33,9],[20,4,20,9],[21,4,21,9],[22,4,22,9],[25,4,25,9],[26,4,26,9],[13,4,13,9],[14,4,14,9],[15,4,15,9],[16,4,16,9],[19,4,19,9],[7,4,7,9],[8,4,8,9],[9,4,9,9],[2,1,2,9],[10,4,10,9]]}
[]
[null,"Development Team",null,null,null,null,null,null,null,""]
[null,"Enter \"TBD\" If Not Yet Known"]
[]
[null,"Development Team Members"]
[]
[null,null,"Managing General Partner (if applicable)"]
[null,null,"Name:"]
[null,null,"Address:"]
[null,null,"Phone:"]
{"$rows_left_out":56}
{"sheet":"Development Timeline","index":8,"n_rows":36,"n_cols":9,"rows_kept":36,"cut":false,"hidden":false,"merged":[[2,1,2,9],[18,5,18,7],[24,5,24,7],[21,5,21,7],[30,5,30,7],[27,5,27,7]]}
[]
[null,"Development Timeline"]
[]
[]
[null,null,null,null,"Event ",null,null,null,"Date"]
[]
[null,null,null,null,"Site Control"]
[]
[null,null,null,null,"Entitlements "]
[]
{"$rows_left_out":27}
{"sheet":"Predev Financing","index":9,"n_rows":40,"n_cols":7,"rows_kept":40,"cut":false,"hidden":false,"merged":[[33,4,33,6],[24,4,24,6],[25,4,25,6],[27,4,27,6],[15,4,15,6],[16,4,16,6],[17,4,17,6],[18,4,18,6],[39,4,39,5],[38,4,38,6],[29,4,29,6],[32,4,32,6],[14,4,14,6],[23,4,23,6],[37,4,37,6],[30,4,30,5],[26,4,26,6],[21,4,21,5],[28,4,28,6],[34,4,34,6],[35,4,35,6],[36,4,36,6],[19,4,19,6],[20,4,20,6]]}
[]
[null,"Predevelopment Financing"]
[]
[null,null,"Lien Position","Name of Lender/Source","Term in Months","Interest Rate","Amount of Funds"]
[]
[]
[]
[]
[]
[]
{"$rows_left_out":31}
{"sheet":"Sources","index":10,"n_rows":57,"n_cols":17,"rows_kept":57,"cut":false,"hidden":false,"merged":[[18,10,18,11],[43,4,43,6],[53,4,53,6],[48,4,48,6],[38,4,38,6],[41,4,41,5],[44,4,44,5],[45,4,45,5],[46,4,46,5],[40,4,40,5],[2,1,2,8],[34,4,34,5],[35,4,35,5],[36,4,36,5],[39,4,39,5],[33,4,33,6],[18,5,18,6],[56,4,56,5],[49,4,49,5],[50,4,50,5],[51,4,51,5],[54,4,54,5],[55,4,55,5]]}
[]
[null,"Proposed Sources"]
[]
[]
[null,null,"CONSTRUCTION SOURCES"]
[null,null,"Lien Position","Name of Lender/Source","Term in Months","Interest Rate","Amount of Funds","Required Payment","Tax Exempt Amount","Residential Amount","Commercial Amount"]
[]
[]
[]
[]
{"$rows_left_out":48}
{"sheet":"Unit Mix & Funding ","index":11,"n_rows":32,"n_cols":10,"rows_kept":32,"cut":false,"hidden":false,"merged":[]}
[]
["Unit Mix Chart"]
["Number \nof Bedrooms ","Income Limit \n(%AMI, Market, Mgr)","DR-MHP Assisted Units","Total Income Restricted Units (including DR-MHP units)","Non-Restricted Units","Total Units","Max. Gross Rent","Utility Allowance","Net Rent (gross - utility allw.)","Annual Net Rent"]
[null,null,null,null,null,null,0,0,{"$f":"Table3[[#This Row],[Max. Gross Rent]]-Table3[[#This Row],[Utility Allowance]]","v":0}]
[null,null,null,null,null,null,0,0,{"$f":"Table3[[#This Row],[Max. Gross Rent]]-Table3[[#This Row],[Utility Allowance]]","v":0},{"$f":"Table3[[#This Row],[Net Rent (gross - utility allw.)]]*12","v":0}]
[null,null,null,null,null,null,0,0,{"$f":"Table3[[#This Row],[Max. Gross Rent]]-Table3[[#This Row],[Utility Allowance]]","v":0},{"$f":"Table3[[#This Row],[Net Rent (gross - utility allw.)]]*12","v":0}]
[null,null,null,null,null,null,0,0,{"$f":"Table3[[#This Row],[Max. Gross Rent]]-Table3[[#This Row],[Utility Allowance]]","v":0},{"$f":"Table3[[#This Row],[Net Rent (gross - utility allw.)]]*12","v":0}]
[null,null,null,null,null,null,0,0,{"$f":"Table3[[#This Row],[Max. Gross Rent]]-Table3[[#This Row],[Utility Allowance]]","v":0},{"$f":"Table3[[#This Row],[Net Rent (gross - utility allw.)]]*12","v":0}]
[null,null,null,null,null,null,0,0,{"$f":"Table3[[#This Row],[Max. Gross Rent]]-Table3[[#This Row],[Utility Allowance]]","v":0},{"$f":"Table3[[#This Row],[Net Rent (gross - utility allw.)]]*12","v":0}]
[null,null,null,null,null,null,0,0,{"$f":"Table3[[#This Row],[Max. Gross Rent]]-Table3[[#This Row],[Utility Allowance]]","v":0},{"$f":"Table3[[#This Row],[Net Rent (gross - utility allw.)]]*12","v":0}]
{"$rows_left_out":23}
{"sheet":"Operating Subsidies","index":12,"n_rows":34,"n_cols":10,"rows_kept":34,"cut":false,"hidden":false,"merged":[]}
[]
[null,"Operating Subsidies"]
[]
[]
[null,null,"Subsidy Source","Subsidy Program (PBV, PBVASH, etc.)","Number of Subsidized Units","Total Annual Subsidy","Contract Term (Years)","Total Contract Subsidy"]
[null,null,null,null,null,null,null,{"$f":"SUM(F6*G6)","v":0}]
[null,null,null,null,null,null,null,{"$f":"SUM(F7*G7)","v":0}]
[null,null,null,null,null,null,null,0]
[null,null,null,null,null,null,null,0]
[null,null,null,null,null,null,null,0]
{"$rows_left_out":25}
{"sheet":"Development Budget","index":13,"n_rows":115,"n_cols":8,"rows_kept":115,"cut":false,"hidden":false,"merged":[[3,6,4,6],[3,7,4,7]]}
["Development Budget"]
[]
[null,null,null,null,null,null,"Eligible Basis"]
[null,null,"Total","Residential","Non-Residential",null,"New Construction / Rehab","Acquisition"]
[null,null,null,{"$f":"100%-E5","v":1},0]
["Acquisition"]
[null,"Total Land Cost",0,{"$f":"C7*D$5","v":0},{"$f":"C7-D7","v":0}]
[null,"Existing Improvements Value",null,{"$f":"C8*D$5","v":0},{"$f":"C8-D8","v":0}]
[null,"Legal / Title & Recording",null,{"$f":"C9*D$5","v":0},{"$f":"C9-D9","v":0}]
[null,"Total Acquisition Costs",0,{"$f":"SUM(D7:D9)","v":0},{"$f":"SUM(E7:E9)","v":0},null,{"$f":"SUM(G7:G9)","v":0},{"$f":"SUM(H7:H9)","v":0}]
{"$rows_left_out":106}
{"sheet":"Operating Budget","index":14,"n_rows":58,"n_cols":4,"rows_kept":58,"cut":false,"hidden":false,"merged":[[2,1,3,1],[58,0,58,2],[57,0,57,2],[56,0,56,2]]}
[]
["Operating Budget"]
[null,"Residential Component"]
[]
[null,"Proposed","Per Unit","Per Unit"]
["Administrative Expenses","Budget","Per Month","Per Year"]
["   Office Salaries",null,{"$f":"IF(OR(B7<=0),\"\",B7/'Unit Mix & Funding '!F$13/\"12\")","v":""},{"$f":"IF(OR(B7=\"\"),\"\",C7*12)","v":""}]
["   Emp Benefits & Insurance",null,{"$f":"IF(OR(B8=\"\"),\"\",B8/'Unit Mix & Funding '!F$13/\"12\")","v":""},{"$f":"IF(OR(B8=\"\"),\"\",C8*12)","v":""}]
["   On-site Manager",null,{"$f":"IF(OR(B9=\"\"),\"\",B9/'Unit Mix & Funding '!F$13/\"12\")","v":""},""]
["   Maintenance Personnel",null,{"$f":"IF(OR(B10=\"\"),\"\",B10/'Unit Mix & Funding '!F$13/\"12\")","v":""},""]
{"$rows_left_out":49}
{"sheet":"20-Year Cash Flow","index":15,"n_rows":61,"n_cols":22,"rows_kept":61,"cut":false,"hidden":false,"merged":[[1,0,1,8]]}
["20-Year Cash Flow"]
[]
[null,null,1,2,3,4,5,6,7,8,9,10,11,12,13,14,15,16,17,18,19,20]
[]
["Gross Potential Income - Residential",2.5000000000000001E-2,{"$f":"'Unit Mix & Funding '!J13","v":0},{"$f":"C5*(1+$B$5)","v":0},0,0,0,0,0,0,0,0,0,0,0,0,0,{"$f":"Q5*(1+$B$5)","v":0},{"$f":"R5*(1+$B$5)","v":0},{"$f":"S5*(1+$B$5)","v":0},{"$f":"T5*(1+$B$5)","v":0},{"$f":"U5*(1+$B$5)","v":0}]
["Gross Potential Income - Rent Subsidy",2.5000000000000001E-2,{"$f":"'Operating Subsidies'!F15","v":0},{"$f":"C6*(1+$B$6)","v":0},0,0,0,0,0,0,0,0,0,0,0,0,0,{"$f":"Q6*(1+$B$6)","v":0},{"$f":"R6*(1+$B$6)","v":0},{"$f":"S6*(1+$B$6)","v":0},{"$f":"T6*(1+$B$6)","v":0},{"$f":"U6*(1+$B$6)","v":0}]
["Project-funded Capitalized Subsidy Reserve"]
[]
["Miscellaneous Income",2.5000000000000001E-2,0,0,0,0,0,0,0,0,0,0,0,0,0,0,0,0,0,0,0,0]
[]
{"$rows_left_out":52}
{"sheet":"H.2 Service Delivery - HIDDEN","index":16,"n_rows":107,"n_cols":13,"rows_kept":107,"cut":false,"hidden":true,"merged":[]}
[]
[null,"Mentally Ill",{"$f":"IF(OR(#REF!=B2,#REF!=B2,#REF!=B2,#REF!=B2),1,\"\")","v":{"$error":"#REF!"}},"Code"]
[null,"HIV / AIDS",{"$f":"IF(OR(#REF!=B3,#REF!=B3,#REF!=B3,#REF!=B3),1,\"\")","v":{"$error":"#REF!"}},"Application",0]
[null,"Developmentally Disabled",{"$f":"IF(OR(#REF!=B4,#REF!=B4,#REF!=B4,#REF!=B4),1,\"\")","v":{"$error":"#REF!"}},"Loan Close",1]
[null,"Transition Age Youth & Homeless Youth",{"$f":"IF(OR(#REF!=B5,#REF!=B5,#REF!=B5,#REF!=B5),1,\"\")","v":{"$error":"#REF!"}},"Loan Close, if applicable",2]
[null,"Frequent Users of DHS/DMH Services",{"$f":"IF(OR(#REF!=B6,#REF!=B6,#REF!=B6,#REF!=B6),1,\"\")","v":{"$error":"#REF!"}},"Not Applicable",3]
[null,"Homeless Households",{"$f":"IF(OR(#REF!=B7,#REF!=B7,#REF!=B7,#REF!=B7),1,\"\")","v":{"$error":"#REF!"}}]
[null,"Chronically Homeless",{"$f":"IF(OR(#REF!=B8,#REF!=B8,#REF!=B8,#REF!=B8),1,\"\")","v":{"$error":"#REF!"}}]
[null,"Homeless Veterans",{"$f":"IF(OR(#REF!=B9,#REF!=B9,#REF!=B9,#REF!=B9),1,\"\")","v":{"$error":"#REF!"}}]
[null,"Homeless Seniors",{"$f":"IF(OR(#REF!=B10,#REF!=B10,#REF!=B10,#REF!=B10),1,\"\")","v":{"$error":"#REF!"}}]
{"$rows_left_out":98}
{"sheet":"I.16 Sust. Bldg. Methods ","index":17,"n_rows":33,"n_cols":7,"rows_kept":33,"cut":false,"hidden":true,"merged":[[11,1,11,2],[29,1,29,3],[1,1,1,3],[4,1,4,4],[5,2,5,4],[6,2,6,4],[7,2,7,4],[8,2,8,4],[9,2,9,4],[10,2,10,4]]}
[]
[null,"I.16 Sustainable Building Methods Compliance Certification"]
[null,{"$f":"IF(#REF!<>\"\",#REF!,\"\")","v":{"$error":"#REF!"}}]
[]
[null,"REQUIRED SUSTAINABLE BUILDING METHODS"]
[null,1,"Minimum Energy Efficiency: New Construction and Rehabilitation projects must be designed to meet the minimum construction requirements as defined by TCAC Regulations Section 10325(f)(7)(A).  Rehabilitation projects will need to demonstrate a 20% reduction in energy use from tabulated baseline, based on the HERS verified existing condition.  "]
[null,2,"Outdoor water conservation measures that include (not applicable for projects with graywater irrigation systems): \n1) Use native or drought-tolerant plants for a minimum of 75% of landscaped area; select plants from Los Angeles County's Drought-tolerant Plant List found at http://planning.lacounty.gov/green, or the local jurisdiction’s drought-tolerant plant list, if required to do so by the local jurisdiction. \n2) Limit conventional grass/turf to 25% of landscaped area.\n3) Group plants with similar watering needs (hydrozones). \n4) Install high efficiency irrigation system with smart irrigation controls for all landscaping.\n"]
[null,3,"At minimum the project shall recycle and/or salvage 70% of non-hazardous construction and demolition debris. "]
[null,4,"The project shall provide an easily-accessible recycling area for tenant use that serves the entire building. "]
[null,5,"Project team shall conduct a design charrette prior to the NOFA application deadline that meets the criteria specified by Enterprise Green Communities charrettes or requirements of LEED for Homes. At minimum the charrette shall include the architect, civil, MEP, landscape architect, structural, and the energy modeler.   Meeting minutes shall be provided as evidence of the design charrette."]
{"$rows_left_out":24}
{"sheet":"I.16a Hlthy. Design Elem. ","index":18,"n_rows":32,"n_cols":5,"rows_kept":32,"cut":false,"hidden":true,"merged":[[28,1,28,3],[1,1,1,3],[4,1,4,2],[11,1,11,3],[16,1,16,3],[19,1,19,3],[2,1,2,3]]}
[]
[null,"I.16a Healthy Design Elements Compliance Certification"]
[null,{"$f":"IF(#REF!<>\"\",#REF!,\"\")","v":{"$error":"#REF!"}}]
[]
[null,"VOLUNTARY HEALTHY DESIGN ELEMENTS - 20 POINTS MAX",null,"Points","Proposed Project"]
[null,1,"Onsite gym incentive:  Projects that include an onsite gym will receive ten (10) points.  Applicants must include at least three varieties of cardio equipment as well as strength training equipment. Room must be open at convenient times (before and after work hours and at lunch, and a minimum of 10 hours per day). ",10]
[null,2,"Designated Exercise Room: Projects that provide a designated exercise room will receive five (5) points.  The room must be open at convenient times (before and after work hours and at lunch, and a minimum of 10 hours per day). Capacity and class offerings should allow 10% of building occupants to take one class weekly.  The exercise room must be set aside for its own use and cannot be part of a community room or other dual-use space.  ",5]
[null,3,"Edible Garden Program:  Projects that provide an Edible Garden Program that includes education, on-site garden space, composting area, and necessary resources will receive five (5) points.  A vertical garden of equal area or an off-site program will be considered.  See incentive requirements in Appendix 7.  Must include reference to the Edible Garden in Service Plan",5]
[null,4,"Container Garden and Edible Landscaping Program:  Projects that do not have enough space to fully integrate an Edible Garden Program into the site plan may propose a Container Garden and Edible Landscaping Program for the development to receive three (3) points.  This program would involve the use of edible landscape components, which could include fruit trees, culinary herbs, and shrubs such as berries that could be put in designated areas of the landscape, such as along walls, fences, and walkways.  Must include reference to the Container Garden and Edible Landscaping Program in Service Plan",3]
[null,5,"Bike racks/secure storage: Projects that provide exterior bike racks and a secure interior bike storage room will receive (3) points.  See eligibility criteria and requirements in Appendix 7.",3]
{"$rows_left_out":22}